{"text_format":"1","workbook":"xlsx","n_sheets":7,"sheets":["ReadMe","Instructions","SDGData","SDGPivot(1)","SDGPivot(2)","SDGPivot(3)","SDG7.2Guide"],"not_rendered":{"charts":0,"images":21,"macros":1,"external_links":0,"defined_names":20,"comments":0,"pivot_tables":3},"unopened":[],"bounds":{"document_bytes":16777216,"sheet_cells":100000,"rows_first":2000,"rows_last":500,"rows_between":2000,"halvings":0,"cell_chars":16384,"cell_head_chars":4096},"cells_cut":0,"cells_raw":0,"read":"whole","date_system":"1900"}

{"sheet":"ReadMe","index":0,"n_rows":199,"n_cols":11,"rows_kept":199,"cut":false,"hidden":false,"merged":[[1,6,2,6],[1,7,2,7]]}
[null,"ReadMe",2,3,4,5,"ReadMe",null,null,{"$f":"IF($H$2=\"English\",$C$1,$E$1)","v":4},{"$f":"J1+1","v":5}]
[null,null,null,null,null,null,{"$f":"VLOOKUP(\"SET YOUR LANGUAGE\",TableReadMeTranslation[],$J$1)","v":"SELECTIONNEZ VOTRE LANGUE"},"French",null,{"$f":"VLOOKUP(\"COMPANY NAME\",TableReadMeTranslation[],$J$1)","v":"NOM DE L'ENTREPRISE"},"Company LTD"]
[null,null,null,null,null,null,{"$f":"VLOOKUP(\"EXCHANGE RATE LOCAL CURRENCY / EURO\",TableReadMeTranslation[],$J$1)","v":"TAUX DE CHANGE MONNAIE LOCALE / EURO"},null,{"$f":"IF($H$2=\"English\",1,2)","v":2},{"$f":"VLOOKUP(\"COUNTRY\",TableReadMeTranslation[],$J$1)","v":"PAYS"},"Senegal"]
[null,null,null,null,null,null,null,null,null,{"$f":"VLOOKUP(\"LOCAL CURRENCY\",TableReadMeTranslation[],$J$1)","v":"MONNAIE LOCALE"},"CFA"]
[null,null,null,null,null,null,null,null,null,{"$f":"VLOOKUP(\"EXCHANGE RATE LOCAL CURRENCY / EURO\",TableReadMeTranslation[],$J$1)","v":"TAUX DE CHANGE MONNAIE LOCALE / EURO"},655.96]
[null,null,null,null,null,null,null,null,null,{"$f":"VLOOKUP(\"CONVERSION DATE\",TableReadMeTranslation[],$J$1)","v":"DATE DE CONVERSION"},"2025-07-23"]
{"$rows_left_out":194}
{"sheet":"Instructions","index":1,"n_rows":202,"n_cols":11,"rows_kept":202,"cut":false,"hidden":false,"merged":[[2,6,2,8]]}
[null,null,{"$f":"COLUMN(C1)-1","v":2},{"$f":"COLUMN(D1)-1","v":3},4,5,null,null,null,{"$f":"IF(ReadMe!$H$2=\"English\",C$1,E$1)","v":4},{"$f":"IF(ReadMe!$H$2=\"English\",D$1,F$1)","v":5}]
[null,null,"ReadMe",null,null,null,"ReadMe"]
[null,null,null,null,null,null,{"$error":"#VALUE!"},null,null,{"$f":"VLOOKUP(\"NOTE 0\",TableReadMeTranslation[],ReadMe!$J$1,FALSE)","v":"Cet outil n'a pas pour but d'accepter ou de refuser une idée de projet, mais d'aider à développer une idée de projet en un projet durable grâce à une approche générale dans une vision holistique"},{"$f":"ReadMe!$K$2&CHAR(10)&ReadMe!$K$3","v":"Company LTD\nSenegal"}]
[null,null,"TableInstructions",null,null,null,{"$f":"C4","v":"TableInstructions"}]
[null,{"$f":"ROW(B5)","v":5},"English Item","English Comment","French Item","French Comment","NOTE","SHEET","DATE","ITEM","COMMENT"]
[null,{"$f":"ROW(B6)","v":6}]
{"$rows_left_out":197}
{"sheet":"SDGData","index":2,"n_rows":67,"n_cols":41,"rows_kept":67,"cut":false,"hidden":false,"merged":[[4,14,5,14],[2,33,2,34],[2,35,2,36],[4,15,5,15],[2,20,2,22],[2,16,2,19],[2,29,2,31],[2,23,2,27],[4,26,4,28],[5,26,5,28]]}
[{"$f":"IF(ReadMe!$H$2=\"English\",\"EN\",\"FR\")","v":"FR"},1,{"$f":"B1+1","v":2},{"$f":"C1+1","v":3},{"$f":"D1+1","v":4},{"$f":"E1+1","v":5},{"$f":"F1+1","v":6},{"$f":"G1+1","v":7},{"$f":"H1+1","v":8},{"$f":"I1+1","v":9},{"$f":"J1+1","v":10},{"$f":"K1+1","v":11},{"$f":"L1+1","v":12},{"$f":"M1+1","v":13},{"$f":"N1+1","v":14},{"$f":"O1+1","v":15},{"$f":"P1+1","v":16},{"$f":"Q1+1","v":17},{"$f":"R1+1","v":18},{"$f":"S1+1","v":19},{"$f":"T1+1","v":20},{"$f":"U1+1","v":21},{"$f":"V1+1","v":22},{"$f":"W1+1","v":23},{"$f":"X1+1","v":24},{"$f":"Y1+1","v":25},{"$f":"Z1+1","v":26},{"$f":"AA1+1","v":27},{"$f":"AB1+1","v":28},{"$f":"AC1+1","v":29},{"$f":"AD1+1","v":30},{"$f":"AE1+1","v":31},{"$f":"AF1+1","v":32},{"$f":"AG1+1","v":33},{"$f":"AH1+1","v":34},{"$f":"AI1+1","v":35},{"$f":"AJ1+1","v":36},{"$f":"AK1+1","v":37},{"$f":"AL1+1","v":38},{"$f":"AM1+1","v":39},{"$f":"AN1+1","v":40}]
[null,null,null,null,null,null,null,null,null,null,null,null,null,{"$f":"IF(ReadMe!$I$3=1,$E$1,$F$1)","v":5},{"$f":"IF(ReadMe!$I$3=1,$H$1,$I$1)","v":8},{"$f":"IF(ReadMe!$I$3=1,$J$1,$K$1)","v":10},null,null,null,null,null,null,null,null,null,{"$f":"IF(ReadMe!$I$3=1,$L$1,$M$1)","v":12}]
[null,null,null,null,null,null,null,null,null,null,null,null,null,null,{"$f":"IF(ISERROR(VLOOKUP(\"STEP 0\",TableReadMeTranslation[],ReadMe!$J$1,FALSE)),\"\",VLOOKUP(\"STEP 0\",TableReadMeTranslation[],ReadMe!$J$1,FALSE))","v":"ODD = OBJECTIFS DE DEVELOPPEMENT DURABLE"},{"$error":"#VALUE!"},{"$f":"IF(ISERROR(VLOOKUP(\"STEP 1\",TableReadMeTranslation[],ReadMe!$J$1,FALSE)),\"\",VLOOKUP(\"STEP 1\",TableReadMeTranslation[],ReadMe!$J$1,FALSE))","v":"ETAPE 1 -- DECOUVREZ LES CIBLES ODD ET EVALUEZ L'IMPACT (POSITIF, NEUTRE OU NEGATIF) DE VOTRE ENTREPRISE SUR LES CIBLES ODD"},null,null,null,{"$f":"IF(ISERROR(VLOOKUP(\"STEP 2\",TableReadMeTranslation[],ReadMe!$J$1,FALSE)),\"\",VLOOKUP(\"STEP 2\",TableReadMeTranslation[],ReadMe!$J$1,FALSE))","v":"ETAPE 2 -- VOUS POUVEZ EVENTUELLEMENT AVOIR BESOIN D'AIDE OU AVOIR DES QUESTIONS SUR CES CIBLES ODD.  DANS CE CAS, REMPLISSEZ LES CELLULES CI-DESSOUS"},null,null,{"$f":"IF(ISERROR(VLOOKUP(\"STEP 3\",TableReadMeTranslation[],ReadMe!$J$1,FALSE)),\"\",VLOOKUP(\"STEP 3\",TableReadMeTranslation[],ReadMe!$J$1,FALSE))","v":"ETAPE 3 -- DEFINIR UN NOMBRE D'INDICATEURS POUR VOTRE ENTREPRISE -- NOTES IMPORTANTES\n(1) POUR LES INDICATEURS D'IMPACT AVEC UN FOCUS PAR OVO, VOTRE INDICATEUR ENTREPRISE EST PREDEFINI A L'INDICATEUR D'IMPACT AVEC UN FOCUS PAR OVO\n(2) POUR LES INDICATEURS D'IMPACT SPECIFIQUES AU PROJET, SI VOTRE PROJET A UN IMPACT POSITIF OU NEGATIF ​​SUR LA CIBLE ODD, VOUS DEVEZ DEFINIR UN INDICATEUR ET SI VOTRE PROJET A UN IMPACT NEUTRE, VOUS NE DEVEZ PAS DEFINIR D'INDICATEUR"},null,null,null,null,{"$f":"IF(ISERROR(VLOOKUP(\"STEP 4\",TableReadMeTranslation[],ReadMe!$J$1,FALSE)),\"\",VLOOKUP(\"STEP 4\",TableReadMeTranslation[],ReadMe!$J$1,FALSE))","v":"ETAPE 4 -- VOUS POUVEZ EGALEMENT AJOUTER UN COMMENTAIRE A VOTRE INDICATEUR"},{"$f":"IF(ISERROR(VLOOKUP(\"STEP 5\",TableReadMeTranslation[],ReadMe!$J$1,FALSE)),\"\",VLOOKUP(\"STEP 5\",TableReadMeTranslation[],ReadMe!$J$1,FALSE))","v":"ETAPE 5 -- DEFINISSEZ LA BASE DE REFERENCE ET L'OBJECTIF DE CHAQUE INDICATEUR QUE VOUS AVEZ SELECTIONNE"},null,null,{"$f":"IF(ISERROR(VLOOKUP(\"STEP 6\",TableReadMeTranslation[],ReadMe!$J$1,FALSE)),\"\",VLOOKUP(\"STEP 6\",TableReadMeTranslation[],ReadMe!$J$1,FALSE))","v":"ETAPE 6 -- VOUS POUVEZ EGALEMENT AJOUTER UN COMMENTAIRE A LA BASE DE REFERENCE ET A L'OBJECTIF QUE VOUS AVEZ FIXES"},{"$f":"IF(ISERROR(VLOOKUP(\"STEP 7\",TableReadMeTranslation[],ReadMe!$J$1,FALSE)),\"\",VLOOKUP(\"STEP 7\",TableReadMeTranslation[],ReadMe!$J$1,FALSE))","v":"ETAPE 7 -- A REMPLIR UNIQUEMENT PENDANT LA PHASE D'EXECUTION DE VOTRE PROJET\nMESUREZ VOTRE INDICATEUR A LA DATE DE DEBUT DE LA PHASE D'EXECUTION ET, SI VOUS LE SOUHAITEZ, COMMENTEZ LE RESULTAT"},null,{"$f":"IF(ISERROR(VLOOKUP(\"STEP 8\",TableReadMeTranslation[],ReadMe!$J$1,FALSE)),\"\",VLOOKUP(\"STEP 8\",TableReadMeTranslation[],ReadMe!$J$1,FALSE))","v":"ETAPE 8 -- A REMPLIR UNIQUEMENT PENDANT LA PHASE D'EXECUTION DE VOTRE PROJET\nMESUREZ VOTRE INDICATEUR A LA DATE DE FIN DE LA PHASE D'EXECUTION ET, SI VOUS LE SOUHAITEZ, COMMENTEZ LE RESULTAT"}]
[null,"TableSDGData",null,null,null,null,null,null,null,null,null,null,null,null,"ReadMe","Instructions"]
[null,"#","#",null,null,null,null,null,null,null,null,null,null,null,{"$f":"ReadMe!$K$2","v":"Company LTD"},{"$f":"ReadMe!$K$3","v":"Senegal"},{"$f":"COUNTIF(TableSDGData[PROJECT POSITIVE TO SDG '#],$T5)","v":0},{"$f":"COUNTIF(TableSDGData[PROJECT NEUTRAL TO SDG '#],$T5)","v":41},{"$f":"COUNTIF(TableSDGData[PROJECT NEGATIVE TO SDG '#],$T5)","v":0},1,null,null,null,{"$f":"IF(ISERROR(VLOOKUP(\"INDICATORS #\",TableReadMeTranslation[],ReadMe!$J$1,FALSE)),\"\",VLOOKUP(\"INDICATORS #\",TableReadMeTranslation[],ReadMe!$J$1,FALSE))","v":"INDICATEURS #"},{"$f":"IF(ISERROR(VLOOKUP(\"INDICATORS #\",TableReadMeTranslation[],ReadMe!$J$1,FALSE)),\"\",VLOOKUP(\"INDICATORS #\",TableReadMeTranslation[],ReadMe!$J$1,FALSE))","v":"INDICATEURS #"},null,{"$f":"IF(ISERROR(VLOOKUP(\"EXPECTED INDICATOR RESPONSES #\",TableReadMeTranslation[],ReadMe!$J$1,FALSE)),\"\",VLOOKUP(\"EXPECTED INDICATOR RESPONSES #\",TableReadMeTranslation[],ReadMe!$J$1,FALSE))","v":"REPONSES ATTENDUES POUR LES INDICATEURS #"},null,null,{"$f":"COUNTA(TableSDGData[COMPANY INDICATOR])","v":7},{"$f":"AD5","v":7},null,null,{"$f":"AD5","v":7},null,{"$f":"AD5","v":7}]
[null,{"$f":"COUNT(TableSDGData[SORT])","v":58},{"$f":"COUNTA(TableSDGData[COUNT])","v":41},null,null,null,null,null,null,null,null,null,null,null,null,null,{"$f":"COUNTIF(TableSDGData[PROJECT POSITIVE TO SDG '#],$T6)","v":41},{"$f":"COUNTIF(TableSDGData[PROJECT NEUTRAL TO SDG '#],$T6)","v":0},{"$f":"COUNTIF(TableSDGData[PROJECT NEGATIVE TO SDG '#],$T6)","v":41},0,null,null,null,{"$f":"COUNTIF(TableSDGData[OVO FOCUS IMPACT INDICATORS],1)","v":7},{"$f":"COUNTIF(TableSDGData[PROJECT SPECIFIC IMPACT INDICATORS],1)","v":7},null,{"$f":"IF(ISERROR(VLOOKUP(\"ENTERED INDICATOR RESPONSES #\",TableReadMeTranslation[],ReadMe!$J$1,FALSE)),\"\",VLOOKUP(\"ENTERED INDICATOR RESPONSES #\",TableReadMeTranslation[],ReadMe!$J$1,FALSE))","v":"REPONSES SAISIES POUR LES INDICATEURS #"},null,null,{"$f":"COUNTA(TableSDGData[BASELINE BEFORE START DATE OF THE PROJECT])","v":7},{"$f":"COUNTA(TableSDGData[TARGET AT THE END DATE OF THE PROJECT])","v":7},null,null,{"$f":"COUNTA(TableSDGData[ACHIEVED AT THE MID-TERM OF THE PROJECT])","v":0},null,{"$f":"COUNTA(TableSDGData[ACHIEVED AT THE END DATE OF THE PROJECT])","v":0}]
{"$rows_left_out":62}
{"sheet":"SDGPivot(1)","index":3,"n_rows":13,"n_cols":9,"rows_kept":13,"cut":false,"hidden":false,"merged":[[2,1,3,2]]}
[null,"ReadMe","Instructions"]
[]
[null,{"$error":"#VALUE!"},null,null,{"$f":"ReadMe!$K$2&CHAR(10)&ReadMe!$K$3","v":"Company LTD\nSenegal"}]
[null,null,null,null,null,null,{"$f":"SUM(G$13:G$61)","v":0},{"$f":"SUM(H$13:H$61)","v":1},{"$f":"SUM(I$13:I$61)","v":0}]
[]
[null,{"$f":"IF(ReadMe!$H$2=\"English\",B12,IF(ISERROR(VLOOKUP(B12,TableReadMeTranslation[],ReadMe!$J$1,FALSE)),\"\",VLOOKUP(B12,TableReadMeTranslation[],ReadMe!$J$1,FALSE)))","v":"OBJECTIF ODD #"},{"$f":"IF(ReadMe!$H$2=\"English\",C12,IF(ISERROR(VLOOKUP(C12,TableReadMeTranslation[],ReadMe!$J$1,FALSE)),\"\",VLOOKUP(C12,TableReadMeTranslation[],ReadMe!$J$1,FALSE)))","v":"CIBLE ODD #"},{"$f":"IF(ReadMe!$H$2=\"English\",D12,IF(ISERROR(VLOOKUP(D12,TableReadMeTranslation[],ReadMe!$J$1,FALSE)),\"\",VLOOKUP(D12,TableReadMeTranslation[],ReadMe!$J$1,FALSE)))","v":"BESOIN D'AIDE ???"},{"$f":"IF(ReadMe!$H$2=\"English\",E12,IF(ISERROR(VLOOKUP(E12,TableReadMeTranslation[],ReadMe!$J$1,FALSE)),\"\",VLOOKUP(E12,TableReadMeTranslation[],ReadMe!$J$1,FALSE)))","v":"QUESTION 1"},{"$f":"IF(ReadMe!$H$2=\"English\",F12,IF(ISERROR(VLOOKUP(F12,TableReadMeTranslation[],ReadMe!$J$1,FALSE)),\"\",VLOOKUP(F12,TableReadMeTranslation[],ReadMe!$J$1,FALSE)))","v":"QUESTION 2"},{"$f":"IF(ReadMe!$H$2=\"English\",RIGHT(G12,LEN(G12)-7),IF(ISERROR(VLOOKUP(RIGHT(G12,LEN(G12)-7),TableReadMeTranslation[],ReadMe!$J$1,FALSE)),\"\",VLOOKUP(RIGHT(G12,LEN(G12)-7),TableReadMeTranslation[],ReadMe!$J$1,FALSE)))","v":"PROJET POSITIF ENVERS L'ODD #"},{"$f":"IF(ReadMe!$H$2=\"English\",RIGHT(H12,LEN(H12)-7),IF(ISERROR(VLOOKUP(RIGHT(H12,LEN(H12)-7),TableReadMeTranslation[],ReadMe!$J$1,FALSE)),\"\",VLOOKUP(RIGHT(H12,LEN(H12)-7),TableReadMeTranslation[],ReadMe!$J$1,FALSE)))","v":"PROJET NEUTRE ENVERS L'ODD #"},{"$f":"IF(ReadMe!$H$2=\"English\",RIGHT(I12,LEN(I12)-7),IF(ISERROR(VLOOKUP(RIGHT(I12,LEN(I12)-7),TableReadMeTranslation[],ReadMe!$J$1,FALSE)),\"\",VLOOKUP(RIGHT(I12,LEN(I12)-7),TableReadMeTranslation[],ReadMe!$J$1,FALSE)))","v":"PROJECT NEGATIF ENVERS L'ODD #"}]
{"$rows_left_out":8}
{"sheet":"SDGPivot(2)","index":4,"n_rows":21,"n_cols":13,"rows_kept":21,"cut":false,"hidden":false,"merged":[[2,1,3,3]]}
[null,"ReadMe","Instructions"]
[]
[null,{"$error":"#VALUE!"},null,null,null,{"$f":"ReadMe!$K$2&CHAR(10)&ReadMe!$K$3","v":"Company LTD\nSenegal"},null,null,null,null,null,{"$f":"ReadMe!$J$4","v":"MONNAIE LOCALE"},{"$f":"ReadMe!$K$4","v":"CFA"}]
[null,null,null,null,null,null,null,null,null,null,null,{"$f":"ReadMe!$J$5","v":"TAUX DE CHANGE MONNAIE LOCALE / EURO"},{"$f":"ReadMe!$K$5","v":655.96}]
[null,null,null,null,null,null,null,null,null,null,null,{"$f":"ReadMe!$J$6","v":"DATE DE CONVERSION"},{"$f":"ReadMe!$K$6","v":"2025-07-23"}]
[]
{"$rows_left_out":16}
{"sheet":"SDGPivot(3)","index":5,"n_rows":55,"n_cols":20,"rows_kept":55,"cut":false,"hidden":false,"merged":[[2,1,3,2]]}
[null,"ReadMe","Instructions"]
[]
[null,{"$error":"#VALUE!"},null,null,null,null,{"$f":"ReadMe!$K$2&CHAR(10)&ReadMe!$K$3","v":"Company LTD\nSenegal"},null,null,null,null,null,{"$f":"ReadMe!$J$4","v":"MONNAIE LOCALE"},{"$f":"ReadMe!$K$4","v":"CFA"}]
[null,null,null,null,null,null,null,null,null,null,null,null,{"$f":"ReadMe!$J$5","v":"TAUX DE CHANGE MONNAIE LOCALE / EURO"},{"$f":"ReadMe!$K$5","v":655.96}]
[null,null,null,null,{"$f":"E9&\" #\"","v":"INDICATEURS D'IMPACT AVEC UN FOCUS PAR OVO #"},{"$f":"COUNTIF(E$15:E$55,1)","v":7},null,null,null,null,null,null,{"$f":"ReadMe!$J$6","v":"DATE DE CONVERSION"},{"$f":"ReadMe!$K$6","v":"2025-07-23"}]
[null,null,null,null,{"$f":"F9&\" #\"","v":"INDICATEURS D'IMPACT SPÉCIFIQUES AU PROJET #"},{"$f":"COUNTIF(F$15:F$55,1)","v":7}]
{"$rows_left_out":50}
{"sheet":"SDG7.2Guide","index":6,"n_rows":31,"n_cols":34,"rows_kept":31,"cut":false,"hidden":false,"merged":[[5,27,5,29],[5,30,5,33],[5,5,5,7],[5,8,5,11],[5,16,5,18],[5,19,5,22]]}
[null,"ReadMe","Instructions",null,null,null,null,null,null,null,null,null,"ReadMe","Instructions",null,null,null,null,null,null,null,null,null,"ReadMe","Instructions"]
[null,"Guide for SDG 7.2",null,null,null,null,null,null,null,null,null,null,"Guide for ODD 7.2",null,null,null,null,null,null,null,null,null,null,{"$f":"IF(ReadMe!$H$2=\"English\",B2,M2)","v":"Guide for ODD 7.2"}]
[null,"By 2030, increase substantially the share of renewable energy in the global energy mix",null,null,null,null,null,null,null,null,null,null,"D’ici à 2030, accroître nettement la part de l’énergie renouvelable dans le bouquet énergétique mondial",null,null,null,null,null,null,null,null,null,null,{"$f":"IF(ReadMe!$H$2=\"English\",B3,M3)","v":"D’ici à 2030, accroître nettement la part de l’énergie renouvelable dans le bouquet énergétique mondial"}]
[null,"Is considered as non-renewable in order of the less worst non-renewable solution: Natural gas > LPG > Fossil oil products > Shale-oil > Coal > Browncoal > Peat",null,null,null,null,null,null,null,null,null,null,"Est considérée comme NON renouvelable dans l'ordre de la solution non renouvelable la moins mauvaise: gaz naturel > GPL > produits pétroliers fossiles > huile de schiste > houille > lignite > tourbe",null,null,null,null,null,null,null,null,null,null,{"$f":"IF(ReadMe!$H$2=\"English\",B4,M4)","v":"Est considérée comme NON renouvelable dans l'ordre de la solution non renouvelable la moins mauvaise: gaz naturel > GPL > produits pétroliers fossiles > huile de schiste > houille > lignite > tourbe"}]
[null,"All those have a negative impact on SDG 13 Climate ",null,null,null,null,null,null,null,null,null,null,"Tous ont un impact négatif sur l'ODD 13 Climat ",null,null,null,null,null,null,null,null,null,null,{"$f":"IF(ReadMe!$H$2=\"English\",B5,M5)","v":"Tous ont un impact négatif sur l'ODD 13 Climat "}]
[null,null,null,null,null,"Potential good contribution to other SDG's",null,null,"Potential negative contribution to other SDG's",null,null,null,null,null,null,null,"Contribution positive potentielle pour autres ODDs",null,null,"Contribution negative potentielle pour autres ODDs",null,null,null,null,null,null,null,{"$f":"IF(ReadMe!$H$2=\"English\",F6,Q6)","v":"Contribution positive potentielle pour autres ODDs"},{"$f":"IF(ReadMe!$H$2=\"English\",G6,R6)","v":0},{"$f":"IF(ReadMe!$H$2=\"English\",H6,S6)","v":0},{"$f":"IF(ReadMe!$H$2=\"English\",I6,T6)","v":"Contribution negative potentielle pour autres ODDs"},{"$f":"IF(ReadMe!$H$2=\"English\",J6,U6)","v":0},{"$f":"IF(ReadMe!$H$2=\"English\",K6,V6)","v":0},{"$f":"IF(ReadMe!$H$2=\"English\",L6,W6)","v":0}]
{"$rows_left_out":25}